Download

Welcome to Gradle 6.1.1! UE4.26

UATHelper: Packaging (Android (ETC2)): …
UATHelper: Packaging (Android (ETC2)): Unzipping C:\Users\Andrey.gradle\wrapper\dists\gradle-6.1.1-all\cfmwm155h49vnt3hynmlrsdst\gradle-6.1.1-all.zip to C:\Users\Andrey.gradle\wrapper\dists\gradle-6.1.1-all\cfmwm155h49vnt3hynmlrsdst
UATHelper: Packaging (Android (ETC2)): Welcome to Gradle 6.1.1!
UATHelper: Packaging (Android (ETC2)): Here are the highlights of this release:
UATHelper: Packaging (Android (ETC2)): - Reusable dependency cache
UATHelper: Packaging (Android (ETC2)): - Configurable compilation order between Groovy/Kotlin/Java/Scala
UATHelper: Packaging (Android (ETC2)): - New sample projects in Gradle’s documentation
UATHelper: Packaging (Android (ETC2)): For more details see Gradle 6.1.1 Release Notes
UATHelper: Packaging (Android (ETC2)): To honour the JVM settings for this build a new JVM will be forked. Please consider using the daemon: The Gradle Daemon.
UATHelper: Packaging (Android (ETC2)): Daemon will be stopped at the end of the build stopping after processing
UATHelper: Packaging (Android (ETC2)): Build-tool 31.0.0 is missing DX at C:\NVPACK\android-sdk-windows\build-tools\31.0.0\dx.bat
UATHelper: Packaging (Android (ETC2)): File C:\Users\Andrey.android\repositories.cfg could not be loaded.
UATHelper: Packaging (Android (ETC2)): Build-tool 31.0.0 is missing DX at C:\NVPACK\android-sdk-windows\build-tools\31.0.0\dx.bat
UATHelper: Packaging (Android (ETC2)): FAILURE: Build failed with an exception.
UATHelper: Packaging (Android (ETC2)): * What went wrong:
UATHelper: Packaging (Android (ETC2)): Could not determine the dependencies of task ‘:app:compileDebugJavaWithJavac’.
UATHelper: Packaging (Android (ETC2)): > Installed Build Tools revision 31.0.0 is corrupted. Remove and install again using the SDK Manager.
UATHelper: Packaging (Android (ETC2)): * Try:
UATHelper: Packaging (Android (ETC2)): Run with --stacktrace option to get the stack trace. Run with --info or --debug option to get more log output. Run with --scan to get full insights.
UATHelper: Packaging (Android (ETC2)): * Get more help at https://help.gradle.org
UATHelper: Packaging (Android (ETC2)): BUILD FAILED in 4m 8s
UATHelper: Packaging (Android (ETC2)): ERROR: cmd.exe failed with args /c “C:\Users\Andrey\Documents\Unreal Projects\Test\Intermediate\Android\armv7\gradle\rungradle.bat” :app:assembleDebug
UATHelper: Packaging (Android (ETC2)): (see C:\Users\Andrey\AppData\Roaming\Unreal Engine\AutomationTool\Logs\C+Program+Files+Epic+Games+UE_4.26\Log.txt for full exception trace)
UATHelper: Packaging (Android (ETC2)): AutomationTool exiting with ExitCode=1 (Error_Unknown)
UATHelper: Packaging (Android (ETC2)): BUILD FAILED
PackagingResults: Error: Unknown Error
LogAudioMixer: Display: Audio Buffer Underrun (starvation) detected.