Quest 2 build from UE 4.26 failing w/ Exception .. Help! (please ... ;)

after renaming my d8 files :slightly_smiling_face: I feel I am SO CLOSE to a successful build!
I remember this feeling when I first built something (utterly amazing at the time) from UE (4.19 I think it was) TO my Note 4 for my Gear VR! :winking_face:

I hope anyone looking will appreciate how close I got before asking for any help!
I explored many extant answers for errors but there is one ‘Exception’ left…

“With your help, I stand on the precipice of infinity!” -Woody (just now)

the error:

FAILURE You Stupid Human! FOILED AGAIN!, Ahem,…: Build failed with an exception.
LogPlayLevel: * What went wrong:
LogPlayLevel: Execution failed for task ‘:app:compileDebugAidl’.
LogPlayLevel: > 1 exception was raised by workers:
LogPlayLevel: java.lang.RuntimeException: java.lang.RuntimeException: Error while executing process C:\Users\Woody\AppData\Local\Android\Sdk\build-tools\33.0.0\aidl.exe with arguments {-pC:\Users\Woody\AppData\Local\Android\Sdk\platforms\android-33\framework.aidl -oY:\app\build\generated
\aidl_source_output_dir\debug\out -IY:\app\src\main\java -IY:\app\src\debug\aidl -IC:\Users\Woody.gradle\caches\transforms-2\files-2.1\f2951af0c9a3852e4971aa7ee1fa81bb\support-media-compat-27.1.0\aidl -IC:\Users\Woody.gradle\caches\transforms-2\files-2.1\42713a44eae2131946fbd126fa19168a\support-compat-27.1.0\aidl -IY:\downloader_library\build\intermediates
\aidl_parcelable\debug\out -IY:\permission_library\build\intermediates\aidl_parcelable\debug\out -dC:\Users\Woody\AppData\Local\Temp\aidl517658657633257769.d Y:\app\src\main\java\com\android\vending\licensing\ILicenseResultListener.aidl}