Download

Packing mistake some people know what the problem is, thank you very much!!!

LogRenderTargetPool:Warning: r.RenderTargetPoolMin exceeded 327/300 MB (ok in editor, bad on fixed memory platform)
MainFrameActions: Packaging (Windows (64-bit)): Program.Main: 2016-08-01T04:16:25.8858424Z: Running on WindowsHostPlatform as a 64-bit process.
MainFrameActions: Packaging (Windows (64-bit)): Automation.ParseCommandLine: Parsing command line: -ScriptsForProject=C:/Users/Administrator/Desktop/new_test/MyProject/MyProject.uproject BuildCookRun -nocompile -nocompileeditor -installed -nop4 -project=C:/Users/Administrator/Desktop/new_test/MyProject/
MainFrameActions: Packaging (Windows (64-bit)): MyProject.uproject -cook -stage -archive -archivedirectory=C:/Users/Administrator/Desktop -package -clientconfig=Development -ue4exe=UE4Editor-Cmd.exe -pak -prereqs -nodebuginfo -targetplatform=Win64 -build -CrashReporter -utf8output
MainFrameActions: Packaging (Windows (64-bit)): Automation.Process: Setting up command environment.
MainFrameActions: Packaging (Windows (64-bit)): WindowsPlatform.get_Compiler: WARNING: Visual C++ 2015 toolchain does not appear to be correctly installed. Please verify that “Common Tools for Visual C++ 2015” was selected when installing Visual Studio 2015.
MainFrameActions: Packaging (Windows (64-bit)): WindowsPlatform.get_Compiler: WARNING: Using Visual Studio 2013 toolchain instead of Visual Studio 2015 toolchain.
MainFrameActions: Packaging (Windows (64-bit)): Automation.Process: Compiling scripts.
MainFrameActions: Packaging (Windows (64-bit)): BuildCookRun.SetupParams: Setting up ProjectParams for C:\Users\Administrator\Desktop
ew_test\MyProject\MyProject.uproject
MainFrameActions: Packaging (Windows (64-bit)): Project.Build: ********** BUILD COMMAND STARTED **********
MainFrameActions: Packaging (Windows (64-bit)): CommandUtils.Run: Run: C:\Program Files (x86)\Epic Games\4.11\Engine\Binaries\DotNET\UnrealBuildTool.exe MyProject Win64 Development -Project=C:\Users\Administrator\Desktop
ew_test\MyProject\MyProject.uproject C:\Users\Administrator\Desktop
ew_test\MyPr
MainFrameActions: Packaging (Windows (64-bit)): oject\MyProject.uproject -remoteini=“C:\Users\Administrator\Desktop
ew_test\MyProject” -noxge -generatemanifest -NoHotReloadFromIDE
MainFrameActions: Packaging (Windows (64-bit)): UnrealBuildTool: Visual C++ 2015 toolchain does not appear to be correctly installed. Please verify that “Common Tools for Visual C++ 2015” was selected when installing Visual Studio 2015.
MainFrameActions: Packaging (Windows (64-bit)): UnrealBuildTool: Using Visual Studio 2013 toolchain instead of Visual Studio 2015 toolchain.
MainFrameActions: Packaging (Windows (64-bit)): CommandUtils.Run: Run: Took 1.6350935s to run UnrealBuildTool.exe, ExitCode=0
MainFrameActions: Packaging (Windows (64-bit)): CommandUtils.Run: Run: C:\Program Files (x86)\Epic Games\4.11\Engine\Binaries\DotNET\UnrealBuildTool.exe MyProject Win64 Development -Project=C:\Users\Administrator\Desktop
ew_test\MyProject\MyProject.uproject C:\Users\Administrator\Desktop
ew_test\MyPr
MainFrameActions: Packaging (Windows (64-bit)): oject\MyProject.uproject -remoteini=“C:\Users\Administrator\Desktop
ew_test\MyProject” -noxge -NoHotReloadFromIDE -ignorejunk
MainFrameActions: Packaging (Windows (64-bit)): UnrealBuildTool: Visual C++ 2015 toolchain does not appear to be correctly installed. Please verify that “Common Tools for Visual C++ 2015” was selected when installing Visual Studio 2015.
MainFrameActions: Packaging (Windows (64-bit)): UnrealBuildTool: Using Visual Studio 2013 toolchain instead of Visual Studio 2015 toolchain.
MainFrameActions: Packaging (Windows (64-bit)): UnrealBuildTool: Creating makefile for MyProject (changes to target files)
MainFrameActions: Packaging (Windows (64-bit)): UnrealBuildTool: Performing 1 actions (18 in parallel)
MainFrameActions: Packaging (Windows (64-bit)): UnrealBuildTool: [1/1] Link MyProject.exe
MainFrameActions: Packaging (Windows (64-bit)): UnrealBuildTool: LINK : fatal error LNK1181: cannot open input file ‘tbbmalloc.lib’
MainFrameActions: Packaging (Windows (64-bit)): UnrealBuildTool: -------- End Detailed Actions Stats -----------------------------------------------------------
MainFrameActions: Packaging (Windows (64-bit)): UnrealBuildTool: ERROR: UBT ERROR: Failed to produce item: C:\Users\Administrator\Desktop
ew_test\MyProject\Binaries\Win64\MyProject.exe
MainFrameActions: Packaging (Windows (64-bit)): UnrealBuildTool: Total build time: 8.08 seconds
MainFrameActions: Packaging (Windows (64-bit)): CommandUtils.Run: Run: Took 8.2264705s to run UnrealBuildTool.exe, ExitCode=5
MainFrameActions: Packaging (Windows (64-bit)): Program.Main: ERROR: AutomationTool terminated with exception: AutomationTool.AutomationException: Command failed (Result:5): C:\Program Files (x86)\Epic Games\4.11\Engine\Binaries\DotNET\UnrealBuildTool.exe MyProject Win64 Development -Project=C:\Users\Ad
MainFrameActions: Packaging (Windows (64-bit)): ministrator\Desktop
ew_test\MyProject\MyProject.uproject C:\Users\Administrator\Desktop
ew_test\MyProject\MyProject.uproject -remoteini=“C:\Users\Administrator\Desktop
ew_test\MyProject” -noxge -NoHotReloadFromIDE -ignorejunk. See logfile for details: ‘UnrealBuildTool-2016.08.01-12.16.28.txt’
MainFrameActions: Packaging (Windows (64-bit)): 在 AutomationTool.CommandUtils.RunAndLog(String App, String CommandLine, String Logfile, Int32 MaxSuccessCode, String Input, ERunOptions Options, Dictionary2 EnvVars) MainFrameActions: Packaging (Windows (64-bit)): 在 AutomationTool.CommandUtils.RunUBT(CommandEnvironment Env, String UBTExecutable, String CommandLine, String LogName, Dictionary2 EnvVars)
MainFrameActions: Packaging (Windows (64-bit)): 在 AutomationTool.UE4Build.BuildWithUBT(String TargetName, UnrealTargetPlatform TargetPlatform, String Config, FileReference UprojectPath, Boolean ForceMonolithic, Boolean ForceNonUnity, Boolean ForceDebugInfo, Boolean ForceFlushMac, Boolean DisableXGE, String InAddArgs, Boolean ForceUnity, Dictionary2 EnvVa rs) MainFrameActions: Packaging (Windows (64-bit)): 在 AutomationTool.UE4Build.Build(BuildAgenda Agenda, Nullable1 InDeleteBuildProducts, Boolean InUpdateVersionFiles, Boolean InForceNoXGE, Boolean InUseParallelExecutor, Boolean InForceNonUnity, Boolean InForceUnity, Boolean InShowProgress, Dictionary2 PlatformEnvVars) MainFrameActions: Packaging (Windows (64-bit)): 在 Project.Build(BuildCommand Command, ProjectParams Params, Int32 WorkingCL, ProjectBuildTargets TargetMask) MainFrameActions: Packaging (Windows (64-bit)): 在 BuildCookRun.DoBuildCookRun(ProjectParams Params) MainFrameActions: Packaging (Windows (64-bit)): 在 AutomationTool.BuildCommand.Execute() MainFrameActions: Packaging (Windows (64-bit)): 在 AutomationTool.Automation.Execute(List1 CommandsToExecute, CaselessDictionary1 Commands) MainFrameActions: Packaging (Windows (64-bit)): 在 AutomationTool.Automation.Process(String] CommandLine) MainFrameActions: Packaging (Windows (64-bit)): 在 AutomationTool.Program.MainProc(Object Param) MainFrameActions: Packaging (Windows (64-bit)): 在 AutomationTool.InternalUtils.RunSingleInstance(Func2 Main, Object Param)
MainFrameActions: Packaging (Windows (64-bit)): 在 AutomationTool.Program.Main()
MainFrameActions: Packaging (Windows (64-bit)): Program.Main: AutomationTool exiting with ExitCode=5 (5)
MainFrameActions: Packaging (Windows (64-bit)): Domain_ProcessExit
MainFrameActions: Packaging (Windows (64-bit)): copying UAT log files…
MainFrameActions: Packaging (Windows (64-bit)): BUILD FAILED

从错误提示中我看到这一条

Visual C++ 2015 toolchain does not appear to be correctly installed. Please verify that “Common Tools for Visual C++ 2015” was selected when installing Visual Studio 2015.

检查一下你的 VC ++ 2015 是否所有工具链都正常安装了,我记得 默认安装状态下,VS2015 是没有包含 VC++ 在里面的,要手工打开勾选一下。
你可以检查看看,也许会有帮助。