Can someone pls help me to fix my university-project?

Hi folks…

i have a big problem.!!! My university-project is not able to create a .exe. I’ve started to do it with
File->cook content for windows

and then we have the problem.

I tryed to fix it with an idea from a friend who told me to delete some folders (Intermidiate, Saved) from the root direction of the project.
At leased nothing worked…
Can someone help me please.?

MainFrameActions: Cooking (Windows): UE4Editor-Cmd: [2015.09.22-17.48.39:764][ 0]LogExit: Exiting.
MainFrameActions: Cooking (Windows): CommandUtils.Run: Run: Took 56,1578362s to run UE4Editor-Cmd.exe, ExitCode=1
MainFrameActions: Cooking (Windows): InternalUtils.SafeCopyFile: SafeCopyFile D:\Software\Unreal\Epic Games\4.8\Engine\Programs\AutomationTool\Saved\Cook.txt C:\Users\Christian\AppData\Roaming\Unreal Engine\AutomationTool\Logs\D+Software+Unreal+Epic+Games+4.8\Cook.txt
MainFrameActions: Cooking (Windows): InternalUtils.SafeDeleteFile: SafeDeleteFile D:\Software\Unreal\Epic Games\4.8\Engine\Programs\AutomationTool\Saved\Cook.txt
MainFrameActions: Cooking (Windows): Project.Cook: Cook failed. Deleting cooked data.
MainFrameActions: Cooking (Windows): ErrorReporter.Error: ERROR: AutomationTool error: Cook failed.
MainFrameActions: Cooking (Windows): BuildCommand.Execute: ERROR: BUILD FAILED
MainFrameActions: Cooking (Windows): Program.Main: ERROR: AutomationTool terminated with exception:
MainFrameActions: Cooking (Windows): Program.Main: ERROR: Exception in AutomationScripts.Automation: BUILD FAILED: Failed while running Cook for C:\Users\Christian\Documents\abschlussprojekt_kds_v2\Abschlussprojekt\unreal\chamber_of_secrets\chamber_of_secrets.uproject; see log C:\Users\Christ
MainFrameActions: Cooking (Windows): ian\AppData\Roaming\Unreal Engine\AutomationTool\Logs\D+Software+Unreal+Epic+Games+4.8\Cook.txt
MainFrameActions: Cooking (Windows): Stacktrace: bei Project.Cook(ProjectParams Params)
MainFrameActions: Cooking (Windows): bei BuildCookRun.DoBuildCookRun(ProjectParams Params)
MainFrameActions: Cooking (Windows): bei BuildCommand.Execute()
MainFrameActions: Cooking (Windows): bei AutomationTool.Automation.Execute(List1 CommandsToExecute, CaselessDictionary1 Commands)
MainFrameActions: Cooking (Windows): bei AutomationTool.Automation.Process(String[] CommandLine)
MainFrameActions: Cooking (Windows): bei AutomationTool.Program.MainProc(Object Param)
MainFrameActions: Cooking (Windows): bei AutomationTool.InternalUtils.RunSingleInstance(MainProc Main, Object Param)
MainFrameActions: Cooking (Windows): bei AutomationTool.Program.Main()
MainFrameActions: Cooking (Windows): Program.Main: ERROR: BUILD FAILED: Failed while running Cook for C:\Users\Christian\Documents\abschlussprojekt_kds_v2\Abschlussprojekt\unreal\chamber_of_secrets\chamber_of_secrets.uproject; see log C:\Users\Christian\AppData\Roaming\Unreal Engine\AutomationTool\Logs\D+Software+Unreal+Epic+Games+4.8\Cook.txt
MainFrameActions: Cooking (Windows): ProcessManager.KillAll: Trying to kill 0 spawned processes.
MainFrameActions: Cooking (Windows): Program.Main: AutomationTool exiting with ExitCode=25
MainFrameActions: Cooking (Windows): Domain_ProcessExit
MainFrameActions: Cooking (Windows): ProcessManager.KillAll: Trying to kill 0 spawned processes.
MainFrameActions: Cooking (Windows): copying UAT log files…
MainFrameActions: Cooking (Windows): RunUAT.bat ERROR: AutomationTool was unable to run successfully.
MainFrameActions: Cooking (Windows): BUILD FAILED