Download

Build Error

Hi,

I have an error when creating a build (both development and build), here is the log text, any idea I did try over the weekend and it was working not sure what has changed. There is plenty of space on the hard drive (50GB)


ainFrameActions: Packaging (Windows (64-bit)): UE4Editor-Cmd: 
MainFrameActions: Packaging (Windows (64-bit)): UE4Editor-Cmd: 
MainFrameActions: Packaging (Windows (64-bit)): UE4Editor-Cmd: end: stack for UAT
MainFrameActions: Packaging (Windows (64-bit)): UE4Editor-Cmd: [2015.03.23-19.49.15:328]  0]LogWindows: === Critical error: ===
MainFrameActions: Packaging (Windows (64-bit)): UE4Editor-Cmd: 
MainFrameActions: Packaging (Windows (64-bit)): UE4Editor-Cmd: Fatal error: [File:D:\BuildFarm\buildmachine_++depot+UE4-Releases+4.7\Engine\Source\Runtime\Core\Public\Serialization\Archive.h] [Line: 96] 
MainFrameActions: Packaging (Windows (64-bit)): UE4Editor-Cmd: FMemoryWriter does not support data larger than 2GB. Archive name: H:/Test1/Content/Maps/Test1_Building_Map9.umap.
MainFrameActions: Packaging (Windows (64-bit)): UE4Editor-Cmd: 
MainFrameActions: Packaging (Windows (64-bit)): UE4Editor-Cmd: 
MainFrameActions: Packaging (Windows (64-bit)): UE4Editor-Cmd: 
MainFrameActions: Packaging (Windows (64-bit)): UE4Editor-Cmd: 
MainFrameActions: Packaging (Windows (64-bit)): UE4Editor-Cmd: KERNELBASE.dll!UnknownFunction (0x000007fefdb5940d) + 0 bytes [UnknownFile:0]
MainFrameActions: Packaging (Windows (64-bit)): UE4Editor-Cmd: 
MainFrameActions: Packaging (Windows (64-bit)): UE4Editor-Cmd: UE4Editor-Core.dll!FOutputDeviceWindowsError::Serialize() (0x000007fed1cc8014) + 0 bytes [d:\buildfarm\buildmachine_++depot+ue4-releases+4.7\engine\source\runtime\core\private\windows\windowsplatformoutputdevices.cpp:95]
MainFrameActions: Packaging (Windows (64-bit)): UE4Editor-Cmd: 
MainFrameActions: Packaging (Windows (64-bit)): UE4Editor-Cmd: UE4Editor-Core.dll!FMsg::Logf__VA() (0x000007fed1b476ef) + 0 bytes [d:\buildfarm\buildmachine_++depot+ue4-releases+4.7\engine\source\runtime\core\private\misc\outputdevice.cpp:526]
MainFrameActions: Packaging (Windows (64-bit)): UE4Editor-Cmd: 
MainFrameActions: Packaging (Windows (64-bit)): UE4Editor-Cmd: UE4Editor-CoreUObject.dll!FMemoryWriter::Serialize() (0x000007fed16fcbdd) + 136 bytes [d:\buildfarm\buildmachine_++depot+ue4-releases+4.7\engine\source\runtime\core\public\serialization\archive.h:96]
MainFrameActions: Packaging (Windows (64-bit)): UE4Editor-Cmd: 
MainFrameActions: Packaging (Windows (64-bit)): UE4Editor-Cmd: UE4Editor-CoreUObject.dll!FUntypedBulkData::SerializeBulkData() (0x000007fed16fe9c7) + 0 bytes [d:\buildfarm\buildmachine_++depot+ue4-releases+4.7\engine\source\runtime\coreuobject\private\serialization\bulkdata.cpp:1017]
MainFrameActions: Packaging (Windows (64-bit)): UE4Editor-Cmd: 
MainFrameActions: Packaging (Windows (64-bit)): UE4Editor-Cmd: UE4Editor-CoreUObject.dll!UPackage::SavePackage() (0x000007fed17ddeaf) + 0 bytes [d:\buildfarm\buildmachine_++depot+ue4-releases+4.7\engine\source\runtime\coreuobject\private\uobject\savepackage.cpp:3455]
MainFrameActions: Packaging (Windows (64-bit)): UE4Editor-Cmd: 
MainFrameActions: Packaging (Windows (64-bit)): UE4Editor-Cmd: UE4Editor-UnrealEd.dll!UEditorEngine::SavePackage() (0x000007fecc598411) + 115 bytes [d:\buildfarm\buildmachine_++depot+ue4-releases+4.7\engine\source\editor\unrealed\private\editor.cpp:4416]
MainFrameActions: Packaging (Windows (64-bit)): UE4Editor-Cmd: 
MainFrameActions: Packaging (Windows (64-bit)): UE4Editor-Cmd: UE4Editor-UnrealEd.dll!UCookCommandlet::SaveCookedPackage() (0x000007feccaed64f) + 110 bytes [d:\buildfarm\buildmachine_++depot+ue4-releases+4.7\engine\source\editor\unrealed\private\commandlets\cookcommandlet.cpp:455]
MainFrameActions: Packaging (Windows (64-bit)): UE4Editor-Cmd: 
MainFrameActions: Packaging (Windows (64-bit)): UE4Editor-Cmd: UE4Editor-UnrealEd.dll!UCookCommandlet::Cook() (0x000007fecca9fc69) + 62 bytes [d:\buildfarm\buildmachine_++depot+ue4-releases+4.7\engine\source\editor\unrealed\private\commandlets\cookcommandlet.cpp:1344]
MainFrameActions: Packaging (Windows (64-bit)): UE4Editor-Cmd: 
MainFrameActions: Packaging (Windows (64-bit)): UE4Editor-Cmd: UE4Editor-UnrealEd.dll!UCookCommandlet::Main() (0x000007feccad0648) + 5 bytes [d:\buildfarm\buildmachine_++depot+ue4-releases+4.7\engine\source\editor\unrealed\private\commandlets\cookcommandlet.cpp:578]
MainFrameActions: Packaging (Windows (64-bit)): UE4Editor-Cmd: 
MainFrameActions: Packaging (Windows (64-bit)): UE4Editor-Cmd: UE4Editor-Cmd.exe!FEngineLoop::PreInit() (0x000000013f6dba3a) + 96 bytes [d:\buildfarm\buildmachine_++depot+ue4-releases+4.7\engine\source\runtime\launch\private\launchengineloop.cpp:1536]
MainFrameActions: Packaging (Windows (64-bit)): UE4Editor-Cmd: 
MainFrameActions: Packaging (Windows (64-bit)): UE4Editor-Cmd: UE4Editor-Cmd.exe!GuardedMain() (0x000000013f6d21fb) + 15 bytes [d:\buildfarm\buildmachine_++depot+ue4-releases+4.7\engine\source\runtime\launch\private\launch.cpp:110]
MainFrameActions: Packaging (Windows (64-bit)): UE4Editor-Cmd: 
MainFrameActions: Packaging (Windows (64-bit)): UE4Editor-Cmd: UE4Editor-Cmd.exe!GuardedMainWrapper() (0x000000013f6d26ea) + 5 bytes [d:\buildfarm\buildmachine_++depot+ue4-releases+4.7\engine\source\runtime\launch\private\windows\launchwindows.cpp:126]
MainFrameActions: Packaging (Windows (64-bit)): UE4Editor-Cmd: 
MainFrameActions: Packaging (Windows (64-bit)): UE4Editor-Cmd: UE4Editor-Cmd.exe!WinMain() (0x000000013f6e2219) + 17 bytes [d:\buildfarm\buildmachine_++depot+ue4-releases+4.7\engine\source\runtime\launch\private\windows\launchwindows.cpp:202]
MainFrameActions: Packaging (Windows (64-bit)): UE4Editor-Cmd: 
MainFrameActions: Packaging (Windows (64-bit)): UE4Editor-Cmd: UE4Editor-Cmd.exe!__tmainCRTStartup() (0x000000013f6e2d05) + 21 bytes [f:\dd\vctools\crt\crtw32\dllstuff\crtexe.c:618]
MainFrameActions: Packaging (Windows (64-bit)): UE4Editor-Cmd: 
MainFrameActions: Packaging (Windows (64-bit)): UE4Editor-Cmd: kernel32.dll!UnknownFunction (0x00000000778c59ed) + 0 bytes [UnknownFile:0]
MainFrameActions: Packaging (Windows (64-bit)): UE4Editor-Cmd: 
MainFrameActions: Packaging (Windows (64-bit)): UE4Editor-Cmd: ntdll.dll!UnknownFunction (0x00000000779fc541) + 0 bytes [UnknownFile:0]
MainFrameActions: Packaging (Windows (64-bit)): UE4Editor-Cmd: 
MainFrameActions: Packaging (Windows (64-bit)): UE4Editor-Cmd: ntdll.dll!UnknownFunction (0x00000000779fc541) + 0 bytes [UnknownFile:0]
MainFrameActions: Packaging (Windows (64-bit)): UE4Editor-Cmd: 
MainFrameActions: Packaging (Windows (64-bit)): UE4Editor-Cmd: 
MainFrameActions: Packaging (Windows (64-bit)): UE4Editor-Cmd: 
MainFrameActions: Packaging (Windows (64-bit)): UE4Editor-Cmd: 
MainFrameActions: Packaging (Windows (64-bit)): UE4Editor-Cmd: [2015.03.23-19.49.15:335]  0]LogExit: Executing StaticShutdownAfterError
MainFrameActions: Packaging (Windows (64-bit)): UE4Editor-Cmd: [2015.03.23-19.49.15:342]  0]LogWindows: FPlatformMisc::RequestExit(1)
MainFrameActions: Packaging (Windows (64-bit)): CommandUtils.Run: Run: Took 28.2556162s to run UE4Editor-Cmd.exe, ExitCode=3
MainFrameActions: Packaging (Windows (64-bit)): Project.Cook: Cook failed. Deleting cooked data.
MainFrameActions: Packaging (Windows (64-bit)): ErrorReporter.Error: ERROR: AutomationTool error: Cook failed.
MainFrameActions: Packaging (Windows (64-bit)): BuildCommand.Execute: ERROR: BUILD FAILED
MainFrameActions: Packaging (Windows (64-bit)): Program.Main: ERROR: AutomationTool terminated with exception:
MainFrameActions: Packaging (Windows (64-bit)): Program.Main: ERROR: Exception in AutomationScripts.Automation: BUILD FAILED: Failed while running Cook for H:\Test1\NewProject.uproject; see log C:\Users\Core_Z820_ESC\AppData\Roaming\Unreal Engine\AutomationT
MainFrameActions: Packaging (Windows (64-bit)): ool\Logs\G+Program+Files+Unreal+Engine+4.7\Cook.txt
MainFrameActions: Packaging (Windows (64-bit)): Stacktrace:    at Project.Cook(ProjectParams Params)
MainFrameActions: Packaging (Windows (64-bit)):    at BuildCookRun.DoBuildCookRun(ProjectParams Params)
MainFrameActions: Packaging (Windows (64-bit)):    at BuildCommand.Execute()
MainFrameActions: Packaging (Windows (64-bit)):    at AutomationTool.Automation.Execute(List`1 CommandsToExecute, CaselessDictionary`1 Commands)
MainFrameActions: Packaging (Windows (64-bit)):    at AutomationTool.Automation.Process(String] CommandLine)
MainFrameActions: Packaging (Windows (64-bit)):    at AutomationTool.Program.MainProc(Object Param)
MainFrameActions: Packaging (Windows (64-bit)):    at AutomationTool.InternalUtils.RunSingleInstance(MainProc Main, Object Param)
MainFrameActions: Packaging (Windows (64-bit)):    at AutomationTool.Program.Main()
MainFrameActions: Packaging (Windows (64-bit)): Program.Main: ERROR: BUILD FAILED: Failed while running Cook for H:\Test1\NewProject.uproject; see log C:\Users\Core_Z820_ESC\AppData\Roaming\Unreal Engine\AutomationTool\Logs\G+Program+Files+Unreal+Engine+4.7\Cook.txt
MainFrameActions: Packaging (Windows (64-bit)): ProcessManager.KillAll: Trying to kill 0 spawned processes.
MainFrameActions: Packaging (Windows (64-bit)): Program.Main: AutomationTool exiting with ExitCode=25
MainFrameActions: Packaging (Windows (64-bit)): Domain_ProcessExit
MainFrameActions: Packaging (Windows (64-bit)): ProcessManager.KillAll: Trying to kill 0 spawned processes.
MainFrameActions: Packaging (Windows (64-bit)): copying UAT log files...
MainFrameActions: Packaging (Windows (64-bit)): RunUAT.bat ERROR: AutomationTool was unable to run successfully.
MainFrameActions: Packaging (Windows (64-bit)): BUILD FAILED
LogContentBrowser:Verbose: The content browser source was changed by the sources view to '/Game/Movies'
LogMaterial: Missing cached shader map for material BBCMoviewtexture_Mat, compiling. 
LogActorComponent: UnregisterComponent: (/Engine/Transient.SkeletalMeshComponent_0) Not registered. Aborting.
LogActorComponent: UnregisterComponent: (/Engine/Transient.SkeletalMeshComponent_0) Not registered. Aborting.
LogActorComponent: RegisterComponentWithWorld: (/Engine/Transient.MaterialEditorMeshComponent_0) Already registered. Aborting.
LogActorComponent: UnregisterComponent: (/Engine/Transient.SkeletalMeshComponent_0) Not registered. Aborting.
LogActorComponent: RegisterComponentWithWorld: (/Engine/Transient.MaterialEditorMeshComponent_0) Already registered. Aborting.
LogMaterial: Missing cached shader map for material BBCMoviewtexture_Mat, compiling. 
LogMaterial: 0.000105 seconds spent updating 1 materials, 1 interfaces, 0 instances, 0 with static permutations.
LogMaterial: Missing cached shader map for material FMatExpressionPreview MaterialExpressionTextureSample_0, compiling. 
MaterialEditorStats: Info Base pass shader with static lighting: 61 instructions
MaterialEditorStats: Info Base pass shader with only dynamic lighting: 30 instructions
MaterialEditorStats: Info Vertex shader: 33 instructions
MaterialEditorStats: Info Texture samplers: 3/16