Announcement

Collapse
No announcement yet.

Error al empaquetar para android (Could not find com.android.tools.build:gradle:3.2.1)

Collapse
X
 
  • Filter
  • Time
  • Show
Clear All
new posts

    Error al empaquetar para android (Could not find com.android.tools.build:gradle:3.2.1)

    ====2/14/2020 3:33:55 PM====PERFORMING FINAL APK PACKAGE OPERATION================================================
    UATHelper: Empaquetado (Android (Multi:ASTC,PVRTC,DXT,ATC,ETC2,ETC1)): Fixing minSdkVersion; requires minSdkVersion of 14 with Gradle based on active plugins
    UATHelper: Empaquetado (Android (Multi:ASTC,PVRTC,DXT,ATC,ETC2,ETC1)): Fixing minSdkVersion; NDK level above 19 requires minSdkVersion of 21 (arch=armv7)
    UATHelper: Empaquetado (Android (Multi:ASTC,PVRTC,DXT,ATC,ETC2,ETC1)): Creating rungradle.bat to work around commandline length limit (using unused drive letter Z
    UATHelper: Empaquetado (Android (Multi:ASTC,PVRTC,DXT,ATC,ETC2,ETC1)): Making .apk with Gradle...
    UATHelper: Empaquetado (Android (Multi:ASTC,PVRTC,DXT,ATC,ETC2,ETC1)): To honour the JVM settings for this build a new JVM will be forked. Please consider using the daemon: https://docs.gradle.org/4.6/userguid...le_daemon.html.
    UATHelper: Empaquetado (Android (Multi:ASTC,PVRTC,DXT,ATC,ETC2,ETC1)): Daemon will be stopped at the end of the build stopping after processing
    UATHelper: Empaquetado (Android (Multi:ASTC,PVRTC,DXT,ATC,ETC2,ETC1)): FAILURE: Build failed with an exception.
    UATHelper: Empaquetado (Android (Multi:ASTC,PVRTC,DXT,ATC,ETC2,ETC1)): * What went wrong:
    UATHelper: Empaquetado (Android (Multi:ASTC,PVRTC,DXT,ATC,ETC2,ETC1)): A problem occurred configuring root project 'app'.
    UATHelper: Empaquetado (Android (Multi:ASTC,PVRTC,DXT,ATC,ETC2,ETC1)): > Could not resolve all artifacts for configuration ':classpath'.
    UATHelper: Empaquetado (Android (Multi:ASTC,PVRTC,DXT,ATC,ETC2,ETC1)): > Could not find com.android.tools.build:gradle:3.2.1.
    UATHelper: Empaquetado (Android (Multi:ASTC,PVRTC,DXT,ATC,ETC2,ETC1)): Searched in the following locations:
    UATHelper: Empaquetado (Android (Multi:ASTC,PVRTC,DXT,ATC,ETC2,ETC1)): https://dl.google.com/dl/android/mav...adle-3.2.1.pom
    UATHelper: Empaquetado (Android (Multi:ASTC,PVRTC,DXT,ATC,ETC2,ETC1)): https://dl.google.com/dl/android/mav...adle-3.2.1.jar
    UATHelper: Empaquetado (Android (Multi:ASTC,PVRTC,DXT,ATC,ETC2,ETC1)): https://jcenter.bintray.com/com/andr...adle-3.2.1.pom
    UATHelper: Empaquetado (Android (Multi:ASTC,PVRTC,DXT,ATC,ETC2,ETC1)): https://jcenter.bintray.com/com/andr...adle-3.2.1.jar
    UATHelper: Empaquetado (Android (Multi:ASTC,PVRTC,DXT,ATC,ETC2,ETC1)): Required by:
    UATHelper: Empaquetado (Android (Multi:ASTC,PVRTC,DXT,ATC,ETC2,ETC1)): project :
    UATHelper: Empaquetado (Android (Multi:ASTC,PVRTC,DXT,ATC,ETC2,ETC1)): * Try:
    UATHelper: Empaquetado (Android (Multi:ASTC,PVRTC,DXT,ATC,ETC2,ETC1)): Run with --stacktrace option to get the stack trace. Run with --info or --debug option to get more log output. Run with --scan to get full insights.
    UATHelper: Empaquetado (Android (Multi:ASTC,PVRTC,DXT,ATC,ETC2,ETC1)): * Get more help at https://help.gradle.org
    UATHelper: Empaquetado (Android (Multi:ASTC,PVRTC,DXT,ATC,ETC2,ETC1)): BUILD FAILED in 8s
    UATHelper: Empaquetado (Android (Multi:ASTC,PVRTC,DXT,ATC,ETC2,ETC1)): ERROR: cmd.exe failed with args /c "C:\Users\Alcibiades\Documents\Unreal Projects\MyProjectA\Intermediate\Android\APK\gradle\rungradle.bat" :app:assembleDebug
    UATHelper: Empaquetado (Android (Multi:ASTC,PVRTC,DXT,ATC,ETC2,ETC1)): (see C:\Users\Alcibiades\AppData\Roaming\Unreal Engine\AutomationTool\Logs\D+Epic+Games+UE_4.24\Log.txt for full exception trace)
    UATHelper: Empaquetado (Android (Multi:ASTC,PVRTC,DXT,ATC,ETC2,ETC1)): AutomationTool exiting with ExitCode=1 (Error_Unknown)
    UATHelper: Empaquetado (Android (Multi:ASTC,PVRTC,DXT,ATC,ETC2,ETC1)): BUILD FAILED
Working...
X